Target
Thromboxane-A synthase
Ligand
BDBM50036375
Substrate
Meas. Tech.
ChEMBL_210278 (CHEMBL808525)
IC50
220±n/a nM
Citation
 Faull, AWBrewster, AGBrown, GRSmithers, MJJackson, R Dual-acting thromboxane receptor antagonist/synthase inhibitors: synthesis and biological properties of [2-substituted-4-(3-pyridyl)-1,3-dioxan-5-yl] alkenoic acids. J Med Chem 38:686-94 (1995)  
Target
Name:
Thromboxane-A synthase
Synonyms:
CYP5 Cytochrome P450 5A1 TBXAS1 TXA synthase TXS Thromboxane A2 Synthase (P450 TxA2) Thromboxane prostanoid Thromboxane-A synthase
Type:
Enzyme
Mol. Mass.:
60524.67
Organism:
Homo sapiens (Human)
Description:
P24557
Residue:
533
  
Inhibitor
Name:
BDBM50036375
Synonyms:
(Z)-6-(2,4-Di-pyridin-3-yl-[1,3]dioxan-5-yl)-hex-4-enoic acid | CHEMBL422541
Type:
Small organic molecule
Emp. Form.:
C20H22N2O4
Mol. Mass.:
354.3997
SMILES:
OC(=O)CC\C=C/CC1COC(OC1c1cccnc1)c1cccnc1
: