Target
Amine oxidase [flavin-containing] B
Ligand
BDBM50491957
Substrate
Meas. Tech.
ChEMBL_965266 (CHEMBL2394149)
Ki
0.460000±n/a nM
Citation
 Strydom, BBergh, JJPetzer, JP Inhibition of monoamine oxidase by phthalide analogues. Bioorg Med Chem Lett 23:1269-73 (2013)  
Target
Name:
Amine oxidase [flavin-containing] B
Synonyms:
AOFB_HUMAN MAOB Monoamine oxidase type B (MAO B) Monoamine oxidase type B (MAOB)
Type:
Protein
Mol. Mass.:
58768.76
Organism:
Homo sapiens (Human)
Description:
P27338
Residue:
520
  
Inhibitor
Name:
BDBM50491957
Synonyms:
CHEMBL2391742
Type:
Small organic molecule
Emp. Form.:
C16H11F3O3
Mol. Mass.:
308.2519
SMILES:
FC(F)(F)c1ccc(COc2ccc3COC(=O)c3c2)cc1
: