Target
Amine oxidase [flavin-containing] B
Ligand
BDBM50491961
Substrate
Meas. Tech.
ChEMBL_965283 (CHEMBL2394315)
IC50
3.5±n/a nM
Citation
 Strydom, BBergh, JJPetzer, JP Inhibition of monoamine oxidase by phthalide analogues. Bioorg Med Chem Lett 23:1269-73 (2013)  
Target
Name:
Amine oxidase [flavin-containing] B
Synonyms:
AOFB_HUMAN MAOB Monoamine oxidase type B (MAO B) Monoamine oxidase type B (MAOB)
Type:
Protein
Mol. Mass.:
58768.76
Organism:
Homo sapiens (Human)
Description:
P27338
Residue:
520
  
Inhibitor
Name:
BDBM50491961
Synonyms:
CHEMBL2391871
Type:
Small organic molecule
Emp. Form.:
C15H11BrO3
Mol. Mass.:
319.15
SMILES:
Brc1cccc(COc2ccc3COC(=O)c3c2)c1
: