Target
Amine oxidase [flavin-containing] B
Ligand
BDBM50491962
Substrate
Meas. Tech.
ChEMBL_965283 (CHEMBL2394315)
IC50
1.8±n/a nM
Citation
 Strydom, BBergh, JJPetzer, JP Inhibition of monoamine oxidase by phthalide analogues. Bioorg Med Chem Lett 23:1269-73 (2013)  
Target
Name:
Amine oxidase [flavin-containing] B
Synonyms:
AOFB_HUMAN MAOB Monoamine oxidase type B (MAO B) Monoamine oxidase type B (MAOB)
Type:
Protein
Mol. Mass.:
58768.76
Organism:
Homo sapiens (Human)
Description:
P27338
Residue:
520
  
Inhibitor
Name:
BDBM50491962
Synonyms:
CHEMBL2391869
Type:
Small organic molecule
Emp. Form.:
C15H11IO3
Mol. Mass.:
366.1505
SMILES:
Ic1ccc(COc2ccc3COC(=O)c3c2)cc1
: