Target
Amine oxidase [flavin-containing] A
Ligand
BDBM50491959
Substrate
Meas. Tech.
ChEMBL_965284 (CHEMBL2394316)
IC50
185±n/a nM
Citation
 Strydom, BBergh, JJPetzer, JP Inhibition of monoamine oxidase by phthalide analogues. Bioorg Med Chem Lett 23:1269-73 (2013)  
Target
Name:
Amine oxidase [flavin-containing] A
Synonyms:
AOFA_HUMAN MAO-A Monoamine oxidase Monoamine oxidase type A (MAO A) Monoamine oxidase type A (MAOA)
Type:
Protein
Mol. Mass.:
59689.53
Organism:
Homo sapiens (Human)
Description:
P21397
Residue:
527
  
Inhibitor
Name:
BDBM50491959
Synonyms:
CHEMBL2391881
Type:
Small organic molecule
Emp. Form.:
C15H18O3
Mol. Mass.:
246.3016
SMILES:
O=C1OCc2ccc(OCC3CCCCC3)cc12
: