Target
Amine oxidase [flavin-containing] A
Ligand
BDBM50491968
Substrate
Meas. Tech.
ChEMBL_965284 (CHEMBL2394316)
IC50
542±n/a nM
Citation
 Strydom, BBergh, JJPetzer, JP Inhibition of monoamine oxidase by phthalide analogues. Bioorg Med Chem Lett 23:1269-73 (2013)  
Target
Name:
Amine oxidase [flavin-containing] A
Synonyms:
AOFA_HUMAN MAO-A Monoamine oxidase Monoamine oxidase type A (MAO A) Monoamine oxidase type A (MAOA)
Type:
Protein
Mol. Mass.:
59689.53
Organism:
Homo sapiens (Human)
Description:
P21397
Residue:
527
  
Inhibitor
Name:
BDBM50491968
Synonyms:
CHEMBL2391741
Type:
Small organic molecule
Emp. Form.:
C15H11FO3
Mol. Mass.:
258.2444
SMILES:
Fc1ccc(COc2ccc3COC(=O)c3c2)cc1
: