Target
Amine oxidase [flavin-containing] A
Ligand
BDBM50491969
Substrate
Meas. Tech.
ChEMBL_965284 (CHEMBL2394316)
IC50
44900±n/a nM
Citation
 Strydom, BBergh, JJPetzer, JP Inhibition of monoamine oxidase by phthalide analogues. Bioorg Med Chem Lett 23:1269-73 (2013)  
Target
Name:
Amine oxidase [flavin-containing] A
Synonyms:
AOFA_HUMAN MAO-A Monoamine oxidase Monoamine oxidase type A (MAO A) Monoamine oxidase type A (MAOA)
Type:
Protein
Mol. Mass.:
59689.53
Organism:
Homo sapiens (Human)
Description:
P21397
Residue:
527
  
Inhibitor
Name:
BDBM50491969
Synonyms:
CHEBI:38085 | CHEMBL2391738
Type:
Small organic molecule
Emp. Form.:
C8H6O2
Mol. Mass.:
134.132
SMILES:
O=C1OCc2ccccc12
: