Target
Amine oxidase [flavin-containing] B
Ligand
BDBM50409074
Substrate
Meas. Tech.
ChEMBL_965285 (CHEMBL2394317)
IC50
230±n/a nM
Citation
 Strydom, BBergh, JJPetzer, JP Inhibition of monoamine oxidase by phthalide analogues. Bioorg Med Chem Lett 23:1269-73 (2013)  
Target
Name:
Amine oxidase [flavin-containing] B
Synonyms:
AOFB_RAT Amine oxidase [flavin-containing] B Monoamine Oxidase Type B (MAO-B) Monoamine oxidase B (MAO-B) Monoamine oxidase type B (MAOB) | Monoamine oxidase-B (MAO-B)
Type:
Enzyme
Mol. Mass.:
58469.65
Organism:
Rattus norvegicus (rat)
Description:
P19643
Residue:
520
  
Inhibitor
Name:
BDBM50409074
Synonyms:
CHEMBL144898
Type:
Small organic molecule
Emp. Form.:
C15H12O3
Mol. Mass.:
240.254
SMILES:
O=C1OCc2ccc(OCc3ccccc3)cc12
: