Target
Amine oxidase [flavin-containing] A
Ligand
BDBM50409074
Substrate
Meas. Tech.
ChEMBL_965286 (CHEMBL2394318)
IC50
3600±n/a nM
Citation
 Strydom, BBergh, JJPetzer, JP Inhibition of monoamine oxidase by phthalide analogues. Bioorg Med Chem Lett 23:1269-73 (2013)  
Target
Name:
Amine oxidase [flavin-containing] A
Synonyms:
AOFA_RAT Amine oxidase [flavin-containing] A Monoamine Oxidase Type A (MAO-A) Monoamine oxidase A (MAO-A) Monoamine oxidase type A (MAOA)
Type:
Enzyme
Mol. Mass.:
59515.21
Organism:
Rattus norvegicus (rat)
Description:
Residue:
526
  
Inhibitor
Name:
BDBM50409074
Synonyms:
CHEMBL144898
Type:
Small organic molecule
Emp. Form.:
C15H12O3
Mol. Mass.:
240.254
SMILES:
O=C1OCc2ccc(OCc3ccccc3)cc12
: