Target
Amine oxidase [flavin-containing] B
Ligand
BDBM50029816
Substrate
Meas. Tech.
ChEMBL_965283 (CHEMBL2394315)
IC50
91±n/a nM
Citation
 Strydom, BBergh, JJPetzer, JP Inhibition of monoamine oxidase by phthalide analogues. Bioorg Med Chem Lett 23:1269-73 (2013)  
Target
Name:
Amine oxidase [flavin-containing] B
Synonyms:
AOFB_HUMAN MAOB Monoamine oxidase type B (MAO B) Monoamine oxidase type B (MAOB)
Type:
Protein
Mol. Mass.:
58768.76
Organism:
Homo sapiens (Human)
Description:
P27338
Residue:
520
  
Inhibitor
Name:
BDBM50029816
Synonyms:
5-Chloro-pyridine-2-carboxylic acid (2-amino-ethyl)-amide Lazabemide | Ro-19-6327
Type:
Small organic molecule
Emp. Form.:
C8H10ClN3O
Mol. Mass.:
199.638
SMILES:
NCCNC(=O)c1ccc(Cl)cn1
: