Target
Amine oxidase [flavin-containing] B
Ligand
BDBM50491969
Substrate
Meas. Tech.
ChEMBL_965283 (CHEMBL2394315)
IC50
28600±n/a nM
Citation
 Strydom, BBergh, JJPetzer, JP Inhibition of monoamine oxidase by phthalide analogues. Bioorg Med Chem Lett 23:1269-73 (2013)  
Target
Name:
Amine oxidase [flavin-containing] B
Synonyms:
AOFB_HUMAN MAOB Monoamine oxidase type B (MAO B) Monoamine oxidase type B (MAOB)
Type:
Protein
Mol. Mass.:
58768.76
Organism:
Homo sapiens (Human)
Description:
P27338
Residue:
520
  
Inhibitor
Name:
BDBM50491969
Synonyms:
CHEBI:38085 | CHEMBL2391738
Type:
Small organic molecule
Emp. Form.:
C8H6O2
Mol. Mass.:
134.132
SMILES:
O=C1OCc2ccccc12
: