Target
Amine oxidase [flavin-containing] B
Ligand
BDBM50491970
Substrate
Meas. Tech.
ChEMBL_965283 (CHEMBL2394315)
IC50
11±n/a nM
Citation
 Strydom, BBergh, JJPetzer, JP Inhibition of monoamine oxidase by phthalide analogues. Bioorg Med Chem Lett 23:1269-73 (2013)  
Target
Name:
Amine oxidase [flavin-containing] B
Synonyms:
AOFB_HUMAN MAOB Monoamine oxidase type B (MAO B) Monoamine oxidase type B (MAOB)
Type:
Protein
Mol. Mass.:
58768.76
Organism:
Homo sapiens (Human)
Description:
P27338
Residue:
520
  
Inhibitor
Name:
BDBM50491970
Synonyms:
CHEMBL2391878
Type:
Small organic molecule
Emp. Form.:
C16H13ClO4
Mol. Mass.:
304.725
SMILES:
Clc1ccc(OCCOc2ccc3COC(=O)c3c2)cc1
: