Target
Amine oxidase [flavin-containing] A
Ligand
BDBM50409074
Substrate
Meas. Tech.
ChEMBL_965284 (CHEMBL2394316)
IC50
1190±n/a nM
Citation
 Strydom, BBergh, JJPetzer, JP Inhibition of monoamine oxidase by phthalide analogues. Bioorg Med Chem Lett 23:1269-73 (2013)  
Target
Name:
Amine oxidase [flavin-containing] A
Synonyms:
AOFA_HUMAN MAO-A Monoamine oxidase Monoamine oxidase type A (MAO A) Monoamine oxidase type A (MAOA)
Type:
Protein
Mol. Mass.:
59689.53
Organism:
Homo sapiens (Human)
Description:
P21397
Residue:
527
  
Inhibitor
Name:
BDBM50409074
Synonyms:
CHEMBL144898
Type:
Small organic molecule
Emp. Form.:
C15H12O3
Mol. Mass.:
240.254
SMILES:
O=C1OCc2ccc(OCc3ccccc3)cc12
: