Target
Amine oxidase [flavin-containing] A
Ligand
BDBM50491974
Substrate
Meas. Tech.
ChEMBL_965284 (CHEMBL2394316)
IC50
7330±n/a nM
Citation
 Strydom, BBergh, JJPetzer, JP Inhibition of monoamine oxidase by phthalide analogues. Bioorg Med Chem Lett 23:1269-73 (2013)  
Target
Name:
Amine oxidase [flavin-containing] A
Synonyms:
AOFA_HUMAN MAO-A Monoamine oxidase Monoamine oxidase type A (MAO A) Monoamine oxidase type A (MAOA)
Type:
Protein
Mol. Mass.:
59689.53
Organism:
Homo sapiens (Human)
Description:
P21397
Residue:
527
  
Inhibitor
Name:
BDBM50491974
Synonyms:
CHEMBL2391875
Type:
Small organic molecule
Emp. Form.:
C17H16O3
Mol. Mass.:
268.3071
SMILES:
Cc1ccc(CCOc2ccc3COC(=O)c3c2)cc1
: