Target
Amine oxidase [flavin-containing] B
Ligand
BDBM50491974
Substrate
Meas. Tech.
ChEMBL_965283 (CHEMBL2394315)
IC50
81±n/a nM
Citation
 Strydom, BBergh, JJPetzer, JP Inhibition of monoamine oxidase by phthalide analogues. Bioorg Med Chem Lett 23:1269-73 (2013)  
Target
Name:
Amine oxidase [flavin-containing] B
Synonyms:
AOFB_HUMAN MAOB Monoamine oxidase type B (MAO B) Monoamine oxidase type B (MAOB)
Type:
Protein
Mol. Mass.:
58768.76
Organism:
Homo sapiens (Human)
Description:
P27338
Residue:
520
  
Inhibitor
Name:
BDBM50491974
Synonyms:
CHEMBL2391875
Type:
Small organic molecule
Emp. Form.:
C17H16O3
Mol. Mass.:
268.3071
SMILES:
Cc1ccc(CCOc2ccc3COC(=O)c3c2)cc1
: