Target
Amine oxidase [flavin-containing] A
Ligand
BDBM50491972
Substrate
Meas. Tech.
ChEMBL_965284 (CHEMBL2394316)
IC50
172±n/a nM
Citation
 Strydom, BBergh, JJPetzer, JP Inhibition of monoamine oxidase by phthalide analogues. Bioorg Med Chem Lett 23:1269-73 (2013)  
Target
Name:
Amine oxidase [flavin-containing] A
Synonyms:
AOFA_HUMAN MAO-A Monoamine oxidase Monoamine oxidase type A (MAO A) Monoamine oxidase type A (MAOA)
Type:
Protein
Mol. Mass.:
59689.53
Organism:
Homo sapiens (Human)
Description:
P21397
Residue:
527
  
Inhibitor
Name:
BDBM50491972
Synonyms:
CHEMBL2391739
Type:
Small organic molecule
Emp. Form.:
C15H11ClO3
Mol. Mass.:
274.699
SMILES:
Clc1ccc(COc2ccc3COC(=O)c3c2)cc1
: