Target
B2 bradykinin receptor
Ligand
BDBM50036834
Substrate
Meas. Tech.
ChEMBL_40276 (CHEMBL653409)
Ki
360±n/a nM
Citation
 Kyle, DJChakravarty, SSinsko, JAStormann, TM A proposed model of bradykinin bound to the rat B2 receptor and its utility for drug design. J Med Chem 37:1347-54 (1994)  
Target
Name:
B2 bradykinin receptor
Synonyms:
B2 bradykinin receptor BDKRB2 BKRB2_CAVPO | Bradykinin B2 receptor
Type:
Mol. Mass.:
42217.03
Organism:
Cavia porcellus
Description:
Residue:
372
  
Inhibitor
Name:
BDBM50036834
Synonyms:
CHEMBL262639 | D-Arg-Arg-(12-aminododecanoyl)-Ser-D-Tic-Oic-Arg
Type:
Small organic molecule
Emp. Form.:
C52H88N16O9
Mol. Mass.:
1081.3569
SMILES:
N[C@@H](CCCNC(N)=N)C(=O)N[C@@H](CCCNC(N)=N)C(=O)NCCCCCCCCCCCC(=O)N[C@@H](CO)C(=O)N1CCc2ccccc2C1C(=O)N1CC(C2CCCCC12)C(=O)N[C@@H](CCCNC(N)=N)C(O)=O
: