Target
Renin
Ligand
BDBM50006179
Substrate
Meas. Tech.
ChEMBL_196422 (CHEMBL872990)
IC50
7300±n/a nM
Citation
 Boyd, SAFung, AKBaker, WRMantei, RAStein, HHCohen, JBarlow, JLKlinghofer, VWessale, JLVerburg, KM Nonpeptide renin inhibitors with good intraduodenal bioavailability and efficacy in dog. J Med Chem 37:2991-3007 (1994)  
Target
Name:
Renin
Synonyms:
RENI_RAT Ren1
Type:
PROTEIN
Mol. Mass.:
44272.67
Organism:
Rattus norvegicus
Description:
ChEMBL_222765
Residue:
402
  
Inhibitor
Name:
BDBM50006179
Synonyms:
(2S,4S,5S)-5-{(S)-2-[(S)-1-Benzyl-2-(4-methoxymethoxy-piperidin-1-yl)-2-oxo-ethylamino]-hexanoylamino}-6-cyclohexyl-4-hydroxy-2-isopropyl-hexanoic acid (3-imidazol-1-yl-propyl)-amide CHEMBL49172
Type:
Small organic molecule
Emp. Form.:
C43H70N6O6
Mol. Mass.:
767.0525
SMILES:
CCCC[C@H](N[C@@H](Cc1ccccc1)C(=O)N1CCC(CC1)OCOC)C(=O)N[C@@H](CC1CCCCC1)[C@@H](O)C[C@@H](C(C)C)C(=O)NCCCn1ccnc1
: