Target
Acetylcholinesterase
Ligand
BDBM50037157
Substrate
Meas. Tech.
ChEMBL_29233 (CHEMBL641567)
IC50
98±n/a nM
Citation
 Yamamoto, YIshihara, YKuntz, ID Docking analysis of a series of benzylamino acetylcholinesterase inhibitors with a phthalimide, benzoyl, or indanone moiety. J Med Chem 37:3141-53 (1994)  
Target
Name:
Acetylcholinesterase
Synonyms:
ACES_RAT Acetylcholinesterase and butyrylcholinesterase (AChE and BChE) Acetylcholinesterase, AChE | Ache
Type:
Enzyme
Mol. Mass.:
68193.62
Organism:
Rattus norvegicus (rat)
Description:
P37136
Residue:
614
  
Inhibitor
Name:
BDBM50037157
Synonyms:
3-(1-Benzyl-piperidin-4-yl)-1-(2,3,4,5-tetrahydro-1H-benzo[b]azepin-8-yl)-propan-1-one CHEMBL75013 Zanapezil
Type:
Small organic molecule
Emp. Form.:
C25H32N2O
Mol. Mass.:
376.5344
SMILES:
O=C(CCC1CCN(Cc2ccccc2)CC1)c1ccc2CCCCNc2c1
: