Target
Sterol O-acyltransferase 1
Ligand
BDBM50037625
Substrate
Meas. Tech.
ChEMBL_28496 (CHEMBL645926)
IC50
16±n/a nM
Citation
 Higley, CAWilde, RGMaduskuie, TPJohnson, ALPennev, PBillheimer, JTRobinson, CSGillies, PJWexler, RR Acyl CoA:cholesterol acyltransferase (ACAT) inhibitors: synthesis and structure-activity relationship studies of a new series of trisubstituted imidazoles. J Med Chem 37:3511-22 (1994)  
Target
Name:
Sterol O-acyltransferase 1
Synonyms:
ACAT-1 Acat SOAT1_RAT Sterol O-acyltransferase, Soat
Type:
PROTEIN
Mol. Mass.:
64165.56
Organism:
Rattus norvegicus
Description:
ChEMBL_28796
Residue:
545
  
Inhibitor
Name:
BDBM50037625
Synonyms:
1-[5-(4,5-Diphenyl-1H-imidazol-2-ylsulfanyl)-pentyl]-1-heptyl-3-(2,4,6-trifluoro-phenyl)-urea | CHEMBL326364
Type:
Small organic molecule
Emp. Form.:
C34H39F3N4OS
Mol. Mass.:
608.76
SMILES:
CCCCCCCN(CCCCCSc1nc(c([nH]1)-c1ccccc1)-c1ccccc1)C(=O)Nc1c(F)cc(F)cc1F
: