Target
Sterol O-acyltransferase 1
Ligand
BDBM50037656
Substrate
Meas. Tech.
ChEMBL_28496 (CHEMBL645926)
IC50
30±n/a nM
Citation
 Higley, CAWilde, RGMaduskuie, TPJohnson, ALPennev, PBillheimer, JTRobinson, CSGillies, PJWexler, RR Acyl CoA:cholesterol acyltransferase (ACAT) inhibitors: synthesis and structure-activity relationship studies of a new series of trisubstituted imidazoles. J Med Chem 37:3511-22 (1994)  
Target
Name:
Sterol O-acyltransferase 1
Synonyms:
ACAT-1 Acat SOAT1_RAT Sterol O-acyltransferase, Soat
Type:
PROTEIN
Mol. Mass.:
64165.56
Organism:
Rattus norvegicus
Description:
ChEMBL_28796
Residue:
545
  
Inhibitor
Name:
BDBM50037656
Synonyms:
CHEMBL115686 | N-[5-(4,5-Diphenyl-1H-imidazol-2-ylsulfanyl)-pentyl]-N-heptyl-butyramide
Type:
Small organic molecule
Emp. Form.:
C31H43N3OS
Mol. Mass.:
505.758
SMILES:
CCCCCCCN(CCCCCSc1nc(c([nH]1)-c1ccccc1)-c1ccccc1)C(=O)CCC
: