Target
Sodium-dependent serotonin transporter
Ligand
BDBM50492447
Substrate
Meas. Tech.
ChEMBL_969677 (CHEMBL2406786)
Ki
2.9±n/a nM
Citation
 Thaxton, AIzenwasser, SWade, DStevens, EDMobley, DLJaber, VLomenzo, SATrudell, ML 3-Aryl-3-arylmethoxyazetidines. A new class of high affinity ligands for monoamine transporters. Bioorg Med Chem Lett 23:4404-7 (2013)  
Target
Name:
Sodium-dependent serotonin transporter
Synonyms:
5-HT Transporter 5HT transporter Anandamid membrane transporter, AMT Monoamine transporters; Norepinephrine & serotonin Slc6a4 Sodium-dependent serotonin transporter (SERT) | imipramine receptor
Type:
Multi-pass membrane protein
Mol. Mass.:
70168.43
Organism:
Rattus norvegicus (rat)
Description:
P31652
Residue:
630
  
Inhibitor
Name:
BDBM50492447
Synonyms:
CHEMBL2402546
Type:
Small organic molecule
Emp. Form.:
C16H15Cl4NO
Mol. Mass.:
379.108
SMILES:
Cl.Clc1ccc(COC2(CNC2)c2ccc(Cl)c(Cl)c2)cc1
: