Target
Delta-type opioid receptor
Ligand
BDBM50001157
Substrate
Meas. Tech.
ChEMBL_972367 (CHEMBL2412192)
Ki
0.120000±n/a nM
Citation
 Lee, YSQu, HCDavis, PMa, SWVardanyan, RLai, JPorreca, FHruby, VJ Chiral Effect of a Phe Residue in Position 3 of the Dmt ACS Med Chem Lett 4:656-659 (2013)  
Target
Name:
Delta-type opioid receptor
Synonyms:
D-OR-1 Delta opioid receptor OPIATE Delta OPRD1 OPRK1 | opioid receptor, delta 1
Type:
G Protein-Coupled Receptor (GPCR)
Mol. Mass.:
40382.98
Organism:
Homo sapiens (Human)
Description:
Competition binding assays were carried out using membrane preparations from transfected HN9.10 cells that constitutively expressed the delta opioid receptor.
Residue:
372
  
Inhibitor
Name:
BDBM50001157
Synonyms:
CHEMBL538700
Type:
Small organic molecule
Emp. Form.:
C39H43N5O5
Mol. Mass.:
661.7892
SMILES:
Cc1cc(O)cc(C)c1C[C@H](N)C(=O)N1Cc2ccccc2C[C@H]1C(=O)N[C@@H](Cc1ccccc1)C(=O)N[C@@H](Cc1ccccc1)C(N)=O
: