Target
Carbonic anhydrase 9
Ligand
BDBM50492588
Substrate
Meas. Tech.
ChEMBL_974279 (CHEMBL2411709)
IC50
43±n/a nM
Citation
 Wang, ZCQin, YJWang, PFYang, YAWen, QZhang, XQiu, HYDuan, YTWang, YTSang, YLZhu, HL Sulfonamides containing coumarin moieties selectively and potently inhibit carbonic anhydrases II and IX: design, synthesis, inhibitory activity and 3D-QSAR analysis. Eur J Med Chem 66:1-11 (2013)  
Target
Name:
Carbonic anhydrase 9
Synonyms:
CA-IX CAH9_HUMAN Carbonic anhydrase 9 (CA IX) Carbonic anhydrase 9 precursor Carbonic anhydrase IX (CAIX) Carbonic anhydrases; II & IX MN RCC-associated antigen G250
Type:
Enzyme
Mol. Mass.:
49669.03
Organism:
Homo sapiens (Human)
Description:
Catalytic domain of human cloned isozyme was used in the assay
Residue:
459
  
Inhibitor
Name:
BDBM50492588
Synonyms:
CHEMBL2408084
Type:
Small organic molecule
Emp. Form.:
C28H30ClN3O5S
Mol. Mass.:
556.073
SMILES:
Cc1cc(NS(=O)(=O)c2ccc(cc2)\N=C\c2c(Cl)c3cc(cc(c3oc2=O)C(C)(C)C)C(C)(C)C)no1
: