Target
Tyrosine-protein kinase Yes
Ligand
BDBM25118
Substrate
Meas. Tech.
ChEMBL_974314 (CHEMBL2411893)
IC50
31±n/a nM
Citation
 Patel, PRSun, HLi, SQShen, MKhan, JThomas, CJDavis, MI Identification of potent Yes1 kinase inhibitors using a library screening approach. Bioorg Med Chem Lett 23:4398-403 (2013)  
Target
Name:
Tyrosine-protein kinase Yes
Synonyms:
Proto-oncogene c-Yes YES YES_HUMAN | p61-yes
Type:
Protein
Mol. Mass.:
60801.54
Organism:
Homo sapiens (Human)
Description:
P07947
Residue:
543
  
Inhibitor
Name:
BDBM25118
Synonyms:
(3Z)-4-amino-5-fluoro-3-[5-(4-methylpiperazino)-1,3-dihydrobenzimidazol-2-ylidene]carbostyril CHEMBL522892 | CHIR-258
Type:
Small organic molecule
Emp. Form.:
C21H21FN6O
Mol. Mass.:
392.4294
SMILES:
CN1CCN(CC1)c1ccc2nc([nH]c2c1)-c1c(N)c2c(F)cccc2[nH]c1=O
: