Target
Tyrosine-protein kinase Yes
Ligand
BDBM14948
Substrate
Meas. Tech.
ChEMBL_974313 (CHEMBL2411892)
IC50
22±n/a nM
Citation
 Patel, PRSun, HLi, SQShen, MKhan, JThomas, CJDavis, MI Identification of potent Yes1 kinase inhibitors using a library screening approach. Bioorg Med Chem Lett 23:4398-403 (2013)  
Target
Name:
Tyrosine-protein kinase Yes
Synonyms:
Proto-oncogene c-Yes YES YES_HUMAN | p61-yes
Type:
Protein
Mol. Mass.:
60801.54
Organism:
Homo sapiens (Human)
Description:
P07947
Residue:
543
  
Inhibitor
Name:
BDBM14948
Synonyms:
4-Methyl-3-(3-(2-(methylamino)pyrimidin-4-yl)pyridin-2-yloxy)-N-(3-(trifluoromethyl)phenyl)benzamide pyridinyl pyrimidine 15 | pyridylpyrimidine ether 4
Type:
Small organic molecule
Emp. Form.:
C25H20F3N5O2
Mol. Mass.:
479.4538
SMILES:
CNc1nccc(n1)-c1cccnc1Oc1cc(ccc1C)C(=O)Nc1cccc(c1)C(F)(F)F
: