Target
p-hydroxybenzoate hydroxylase
Ligand
BDBM50038194
Substrate
Meas. Tech.
ChEMBL_221140 (CHEMBL841829)
Ki
69±n/a nM
Citation
 Salituro, FGDemeter, DAWeintraub, HJLippert, BJResvick, RJMcDonald, IA Multisubstrate inhibition of 4-hydroxybenzoate 3-monooxygenase. J Med Chem 37:4076-8 (1995)  
Target
Name:
p-hydroxybenzoate hydroxylase
Synonyms:
PHHY_PSEFL | pobA
Type:
PROTEIN
Mol. Mass.:
44322.61
Organism:
Pseudomonas fluorescens
Description:
ChEMBL_221139
Residue:
394
  
Inhibitor
Name:
BDBM50038194
Synonyms:
2-Benzyloxy-4-hydroxy-benzoic acid | CHEMBL130259
Type:
Small organic molecule
Emp. Form.:
C14H12O4
Mol. Mass.:
244.2427
SMILES:
OC(=O)c1ccc(O)cc1OCc1ccccc1
: