Target
Histamine H3 receptor
Ligand
BDBM50186312
Substrate
Meas. Tech.
ChEMBL_975651 (CHEMBL2416135)
Ki
41±n/a nM
Citation
 Levoin, NLabeeuw, OKrief, SCalmels, TPoupardin-Olivier, OBerrebi-Bertrand, ILecomte, JMSchwartz, JCCapet, M Determination of the binding mode and interacting amino-acids for dibasic H3 receptor antagonists. Bioorg Med Chem 21:4526-9 (2013)  
Target
Name:
Histamine H3 receptor
Synonyms:
G-protein coupled receptor 97 HH3R HRH3 Histamine H3 receptor (H3) Histamine receptor (H3 and H4)
Type:
G Protein-Coupled Receptor (GPCR)
Mol. Mass.:
48691.47
Organism:
Homo sapiens (Human)
Description:
Binding assays were using CHO cells stably expressing hH3R receptors.
Residue:
445
  
Inhibitor
Name:
BDBM50186312
Synonyms:
1-ethyl-6-(3-(piperidin-1-yl)propoxy)-1,2,3,4-tetrahydroquinoline | CHEMBL208691
Type:
Small organic molecule
Emp. Form.:
C19H30N2O
Mol. Mass.:
302.4543
SMILES:
CCN1CCCc2cc(OCCCN3CCCCC3)ccc12
: