Target
D(1A) dopamine receptor
Ligand
BDBM50038345
Substrate
Meas. Tech.
ChEMBL_61342 (CHEMBL879549)
Ki
1300±n/a nM
Citation
 Minor, DLWyrick, SDCharifson, PSWatts, VJNichols, DEMailman, RB Synthesis and molecular modeling of 1-phenyl-1,2,3,4-tetrahydroisoquinolines and related 5,6,8,9-tetrahydro-13bH-dibenzo[a,h]quinolizines as D1 dopamine antagonists. J Med Chem 37:4317-28 (1995)  
Target
Name:
D(1A) dopamine receptor
Synonyms:
DOPAMINE D1 Dopamine D1 high Dopamine receptor Dopamine1-like Drd1a
Type:
Enzyme Catalytic Domain
Mol. Mass.:
49429.75
Organism:
RAT
Description:
P18901
Residue:
446
  
Inhibitor
Name:
BDBM50038345
Synonyms:
(S)-6-Bromo-2-methyl-1-phenyl-1,2,3,4-tetrahydro-isoquinolin-7-ol | CHEMBL334350
Type:
Small organic molecule
Emp. Form.:
C16H16BrNO
Mol. Mass.:
318.208
SMILES:
CN1CCc2cc(Br)c(O)cc2[C@@H]1c1ccccc1
: