Target
Mu-type opioid receptor
Ligand
BDBM50292919
Substrate
Meas. Tech.
ChEMBL_980537 (CHEMBL2422696)
EC50
3.3±n/a nM
Citation
 Yuan, YElbegdorj, OBeletskaya, IOSelley, DEZhang, Y Structure activity relationship studies of 17-cyclopropylmethyl-3,14?-dihydroxy-4,5?-epoxy-6?-(isoquinoline-3'-carboxamido)morphinan (NAQ) analogues as potent opioid receptor ligands: preliminary results on the role of electronic characteristics for affinity and function. Bioorg Med Chem Lett 23:5045-8 (2013)  
Target
Name:
Mu-type opioid receptor
Synonyms:
M-OR-1 Mor OPRM_MOUSE Oprm | Oprm1
Type:
Enzyme Catalytic Domain
Mol. Mass.:
44431.62
Organism:
MOUSE
Description:
OPIATE Mu OPRM1 MOUSE::P42866
Residue:
398
  
Inhibitor
Name:
BDBM50292919
Synonyms:
17-Cyclopropylmethyl-3,14beta-dihydroxy-4,5r-epoxy-6alpha-[(3'-isoquinolyl)acetamido]morphinan | CHEMBL522201
Type:
Small organic molecule
Emp. Form.:
C30H31N3O4
Mol. Mass.:
497.5848
SMILES:
Oc1ccc2C[C@H]3N(CC4CC4)CC[C@@]45[C@@H](Oc1c24)[C@H](CC[C@@]35O)NC(=O)c1cc2ccccc2cn1
: