Target
Acetylcholinesterase
Ligand
BDBM50037157
Substrate
Meas. Tech.
ChEMBL_29232 (CHEMBL641566)
IC50
97.7±n/a nM
Citation
 Ishihara, YHirai, KMiyamoto, MGoto, G Central cholinergic agents. 6. Synthesis and evaluation of 3-[1-(phenylmethyl)-4-piperidinyl]-1-(2,3,4,5-tetrahydro-1H-1-benzazepi n-8-yl)-1-propanones and their analogs as central selective acetylcholinesterase inhibitors. J Med Chem 37:2292-9 (1994)  
Target
Name:
Acetylcholinesterase
Synonyms:
ACES_RAT Acetylcholinesterase and butyrylcholinesterase (AChE and BChE) Acetylcholinesterase, AChE | Ache
Type:
Enzyme
Mol. Mass.:
68193.62
Organism:
Rattus norvegicus (rat)
Description:
P37136
Residue:
614
  
Inhibitor
Name:
BDBM50037157
Synonyms:
3-(1-Benzyl-piperidin-4-yl)-1-(2,3,4,5-tetrahydro-1H-benzo[b]azepin-8-yl)-propan-1-one CHEMBL75013 Zanapezil
Type:
Small organic molecule
Emp. Form.:
C25H32N2O
Mol. Mass.:
376.5344
SMILES:
O=C(CCC1CCN(Cc2ccccc2)CC1)c1ccc2CCCCNc2c1
: