Target
Neprilysin
Ligand
BDBM50039510
Substrate
Meas. Tech.
ChEMBL_144466 (CHEMBL755532)
IC50
32±n/a nM
Citation
 Neustadt, BRSmith, EMNechuta, TLBronnenkant, AAHaslanger, MFWatkins, RWFoster, CJSybertz, EJ Mercaptoacyl amino acid inhibitors of atriopeptidase. 1. Structure-activity relationship studies of methionine and S-alkylcysteine derivatives. J Med Chem 37:2461-76 (1994)  
Target
Name:
Neprilysin
Synonyms:
Atriopeptidase CD_antigen=CD10 MME NEP_RABIT Neutral endopeptidase 24.11
Type:
Enzyme
Mol. Mass.:
85570.75
Organism:
Oryctolagus cuniculus (rabbit)
Description:
NEP was purified to homogeneity from rabbit kidney.
Residue:
750
  
Inhibitor
Name:
BDBM50039510
Synonyms:
(S)-3-Benzylsulfanyl-2-((R)-2-mercaptomethyl-3-phenyl-propionylamino)-propionic acid | CHEMBL81658
Type:
Small organic molecule
Emp. Form.:
C20H23NO3S2
Mol. Mass.:
389.532
SMILES:
OC(=O)[C@@H](CSCc1ccccc1)NC(=O)[C@H](CS)Cc1ccccc1
: