Target
Neprilysin
Ligand
BDBM50039500
Substrate
Meas. Tech.
ChEMBL_144467 (CHEMBL883418)
IC50
17±n/a nM
Citation
 Neustadt, BRSmith, EMNechuta, TLBronnenkant, AAHaslanger, MFWatkins, RWFoster, CJSybertz, EJ Mercaptoacyl amino acid inhibitors of atriopeptidase. 1. Structure-activity relationship studies of methionine and S-alkylcysteine derivatives. J Med Chem 37:2461-76 (1994)  
Target
Name:
Neprilysin
Synonyms:
Atriopeptidase CD_antigen=CD10 MME NEP_RABIT Neutral endopeptidase 24.11
Type:
Enzyme
Mol. Mass.:
85570.75
Organism:
Oryctolagus cuniculus (rabbit)
Description:
NEP was purified to homogeneity from rabbit kidney.
Residue:
750
  
Inhibitor
Name:
BDBM50039500
Synonyms:
(S)-2-((R)-2-Mercaptomethyl-3-phenyl-propionylamino)-3-(4-methoxy-benzylsulfanyl)-propionic acid | CHEMBL310200
Type:
Small organic molecule
Emp. Form.:
C21H25NO4S2
Mol. Mass.:
419.558
SMILES:
COc1ccc(CSC[C@@H](NC(=O)[C@H](CS)Cc2ccccc2)C(O)=O)cc1
: