Target
Purine nucleoside phosphorylase
Ligand
BDBM50039549
Substrate
Meas. Tech.
ChEMBL_162034 (CHEMBL766674)
IC50
11±n/a nM
Citation
 Niwas, SChand, PPathak, VPMontgomery, JA Structure-based design of inhibitors of purine nucleoside phosphorylase. 5. 9-Deazahypoxanthines. J Med Chem 37:2477-80 (1994)  
Target
Name:
Purine nucleoside phosphorylase
Synonyms:
Inosine phosphorylase PNPH_RAT Purine nucleoside phosphorylase nucleoside phosphorylase
Type:
PROTEIN
Mol. Mass.:
32303.61
Organism:
Rattus norvegicus
Description:
ChEMBL_162034
Residue:
289
  
Inhibitor
Name:
BDBM50039549
Synonyms:
3-(2-Amino-4-oxo-4,5-dihydro-3H-pyrrolo[3,2-d]pyrimidin-7-yl)-3-(3-chloro-phenyl)-propionitrile | CHEMBL81839
Type:
Small organic molecule
Emp. Form.:
C15H12ClN5O
Mol. Mass.:
313.742
SMILES:
Nc1nc2c(c[nH]c2c(=O)[nH]1)C(CC#N)c1cccc(Cl)c1
: