Target
Purine nucleoside phosphorylase
Ligand
BDBM50039556
Substrate
Meas. Tech.
ChEMBL_162034 (CHEMBL766674)
IC50
28±n/a nM
Citation
 Niwas, SChand, PPathak, VPMontgomery, JA Structure-based design of inhibitors of purine nucleoside phosphorylase. 5. 9-Deazahypoxanthines. J Med Chem 37:2477-80 (1994)  
Target
Name:
Purine nucleoside phosphorylase
Synonyms:
Inosine phosphorylase PNPH_RAT Purine nucleoside phosphorylase nucleoside phosphorylase
Type:
PROTEIN
Mol. Mass.:
32303.61
Organism:
Rattus norvegicus
Description:
ChEMBL_162034
Residue:
289
  
Inhibitor
Name:
BDBM50039556
Synonyms:
7-Thiophen-3-ylmethyl-3,5-dihydro-pyrrolo[3,2-d]pyrimidin-4-one | CHEMBL81348
Type:
Small organic molecule
Emp. Form.:
C11H9N3OS
Mol. Mass.:
231.274
SMILES:
O=c1[nH]cnc2c(Cc3ccsc3)c[nH]c12
: