Target
Purine nucleoside phosphorylase
Ligand
BDBM50039560
Substrate
Meas. Tech.
ChEMBL_162035 (CHEMBL766675)
Ki
>200000±n/a nM
Citation
 Niwas, SChand, PPathak, VPMontgomery, JA Structure-based design of inhibitors of purine nucleoside phosphorylase. 5. 9-Deazahypoxanthines. J Med Chem 37:2477-80 (1994)  
Target
Name:
Purine nucleoside phosphorylase
Synonyms:
Inosine phosphorylase PNPH_RAT Purine nucleoside phosphorylase nucleoside phosphorylase
Type:
PROTEIN
Mol. Mass.:
32303.61
Organism:
Rattus norvegicus
Description:
ChEMBL_162034
Residue:
289
  
Inhibitor
Name:
BDBM50039560
Synonyms:
9-(4-Hydroxy-butyl)-1,9-dihydro-purin-6-one | CHEMBL83421
Type:
Small organic molecule
Emp. Form.:
C9H12N4O2
Mol. Mass.:
208.2172
SMILES:
OCCCCn1cnc2c1nc[nH]c2=O
: