Target
Purine nucleoside phosphorylase
Ligand
BDBM50039562
Substrate
Meas. Tech.
ChEMBL_162034 (CHEMBL766674)
IC50
29±n/a nM
Citation
 Niwas, SChand, PPathak, VPMontgomery, JA Structure-based design of inhibitors of purine nucleoside phosphorylase. 5. 9-Deazahypoxanthines. J Med Chem 37:2477-80 (1994)  
Target
Name:
Purine nucleoside phosphorylase
Synonyms:
Inosine phosphorylase PNPH_RAT Purine nucleoside phosphorylase nucleoside phosphorylase
Type:
PROTEIN
Mol. Mass.:
32303.61
Organism:
Rattus norvegicus
Description:
ChEMBL_162034
Residue:
289
  
Inhibitor
Name:
BDBM50039562
Synonyms:
2-Amino-7-cyclopentylmethyl-3,5-dihydro-pyrrolo[3,2-d]pyrimidin-4-one | CHEMBL56593
Type:
Small organic molecule
Emp. Form.:
C12H16N4O
Mol. Mass.:
232.2816
SMILES:
Nc1nc2c(CC3CCCC3)c[nH]c2c(=O)[nH]1
: