Target
Purine nucleoside phosphorylase
Ligand
BDBM50039554
Substrate
Meas. Tech.
ChEMBL_162035 (CHEMBL766675)
Ki
10000±n/a nM
Citation
 Niwas, SChand, PPathak, VPMontgomery, JA Structure-based design of inhibitors of purine nucleoside phosphorylase. 5. 9-Deazahypoxanthines. J Med Chem 37:2477-80 (1994)  
Target
Name:
Purine nucleoside phosphorylase
Synonyms:
Inosine phosphorylase PNPH_RAT Purine nucleoside phosphorylase nucleoside phosphorylase
Type:
PROTEIN
Mol. Mass.:
32303.61
Organism:
Rattus norvegicus
Description:
ChEMBL_162034
Residue:
289
  
Inhibitor
Name:
BDBM50039554
Synonyms:
8-Amino-1,7-dihydro-purin-6-one | CHEMBL83601
Type:
Small organic molecule
Emp. Form.:
C5H5N5O
Mol. Mass.:
151.1261
SMILES:
Nc1nc2nc[nH]c(=O)c2[nH]1
: