Target
Purine nucleoside phosphorylase
Ligand
BDBM21868
Substrate
Meas. Tech.
ChEMBL_162035 (CHEMBL766675)
Ki
77000±n/a nM
Citation
 Niwas, SChand, PPathak, VPMontgomery, JA Structure-based design of inhibitors of purine nucleoside phosphorylase. 5. 9-Deazahypoxanthines. J Med Chem 37:2477-80 (1994)  
Target
Name:
Purine nucleoside phosphorylase
Synonyms:
Inosine phosphorylase PNPH_RAT Purine nucleoside phosphorylase nucleoside phosphorylase
Type:
PROTEIN
Mol. Mass.:
32303.61
Organism:
Rattus norvegicus
Description:
ChEMBL_162034
Residue:
289
  
Inhibitor
Name:
BDBM21868
Synonyms:
2-amino-9-(4-hydroxybutyl)-6,9-dihydro-3H-purin-6-one CHEMBL258513 | HBG
Type:
Small organic molecule
Emp. Form.:
C9H13N5O2
Mol. Mass.:
223.2318
SMILES:
Nc1nc2n(CCCCO)cnc2c(=O)[nH]1
: