Target
Purine nucleoside phosphorylase
Ligand
BDBM50039550
Substrate
Meas. Tech.
ChEMBL_162035 (CHEMBL766675)
Ki
>100000±n/a nM
Citation
 Niwas, SChand, PPathak, VPMontgomery, JA Structure-based design of inhibitors of purine nucleoside phosphorylase. 5. 9-Deazahypoxanthines. J Med Chem 37:2477-80 (1994)  
Target
Name:
Purine nucleoside phosphorylase
Synonyms:
Inosine phosphorylase PNPH_RAT Purine nucleoside phosphorylase nucleoside phosphorylase
Type:
PROTEIN
Mol. Mass.:
32303.61
Organism:
Rattus norvegicus
Description:
ChEMBL_162034
Residue:
289
  
Inhibitor
Name:
BDBM50039550
Synonyms:
9-(2-Amino-3,4-dihydroxy-butyl)-1,9-dihydro-purin-6-one | CHEMBL79666
Type:
Small organic molecule
Emp. Form.:
C9H13N5O3
Mol. Mass.:
239.2312
SMILES:
NC(Cn1cnc2c1nc[nH]c2=O)C(O)CO
: