Target
Purine nucleoside phosphorylase
Ligand
BDBM50005799
Substrate
Meas. Tech.
ChEMBL_162035 (CHEMBL766675)
Ki
200±n/a nM
Citation
 Niwas, SChand, PPathak, VPMontgomery, JA Structure-based design of inhibitors of purine nucleoside phosphorylase. 5. 9-Deazahypoxanthines. J Med Chem 37:2477-80 (1994)  
Target
Name:
Purine nucleoside phosphorylase
Synonyms:
Inosine phosphorylase PNPH_RAT Purine nucleoside phosphorylase nucleoside phosphorylase
Type:
PROTEIN
Mol. Mass.:
32303.61
Organism:
Rattus norvegicus
Description:
ChEMBL_162034
Residue:
289
  
Inhibitor
Name:
BDBM50005799
Synonyms:
2,8-Diamino-9-benzyl-1,9-dihydro-purin-6-one | CHEMBL8230
Type:
Small organic molecule
Emp. Form.:
C12H12N6O
Mol. Mass.:
256.2633
SMILES:
Nc1nc2c(nc(N)[nH]c2=O)n1Cc1ccccc1
: