Target
Purine nucleoside phosphorylase
Ligand
BDBM82018
Substrate
Meas. Tech.
ChEMBL_162035 (CHEMBL766675)
Ki
17000±n/a nM
Citation
 Niwas, SChand, PPathak, VPMontgomery, JA Structure-based design of inhibitors of purine nucleoside phosphorylase. 5. 9-Deazahypoxanthines. J Med Chem 37:2477-80 (1994)  
Target
Name:
Purine nucleoside phosphorylase
Synonyms:
Inosine phosphorylase PNPH_RAT Purine nucleoside phosphorylase nucleoside phosphorylase
Type:
PROTEIN
Mol. Mass.:
32303.61
Organism:
Rattus norvegicus
Description:
ChEMBL_162034
Residue:
289
  
Inhibitor
Name:
BDBM82018
Synonyms:
CAS_790 Hypoxanthine | NSC_790
Type:
Small organic molecule
Emp. Form.:
C5H4N4O
Mol. Mass.:
136.1115
SMILES:
O=c1[nH]cnc2nc[nH]c12
: