Target
Prostaglandin G/H synthase 2
Ligand
BDBM50207446
Substrate
Meas. Tech.
ChEMBL_987401 (CHEMBL2438466)
IC50
40±n/a nM
Citation
 Windsor, MAValk, PLXu, SBanerjee, SMarnett, LJ Exploring the molecular determinants of substrate-selective inhibition of cyclooxygenase-2 by lumiracoxib. Bioorg Med Chem Lett 23:5860-4 (2013)  
Target
Name:
Prostaglandin G/H synthase 2
Synonyms:
Cox-2 Cyclooxygenase-2 Glucocorticoid-regulated inflammatory cyclooxygenase Macrophage activation-associated marker protein P71/73 PGH synthase 2 PGHS-2 Pghs-b Prostaglandin H2 synthase 2 Ptgs2 Tis10
Type:
Protein
Mol. Mass.:
69020.39
Organism:
Mus musculus (Mouse)
Description:
Q05769
Residue:
604
  
Inhibitor
Name:
BDBM50207446
Synonyms:
2-(2-(2-chloro-6-fluorophenylamino)-5-methylphenyl)acetic acid | CHEMBL404108
Type:
Small organic molecule
Emp. Form.:
C15H13ClFNO2
Mol. Mass.:
293.721
SMILES:
Cc1ccc(Nc2c(F)cccc2Cl)c(CC(O)=O)c1
: