Target
Retinoic acid receptor alpha
Ligand
BDBM50040011
Substrate
Meas. Tech.
ChEMBL_197386 (CHEMBL799705)
EC50
>10000±n/a nM
Citation
 Boehm, MFZhang, LBadea, BAWhite, SKMais, DEBerger, ESuto, CMGoldman, MEHeyman, RA Synthesis and structure-activity relationships of novel retinoid X receptor-selective retinoids. J Med Chem 37:2930-41 (1994)  
Target
Name:
Retinoic acid receptor alpha
Synonyms:
NR1B1 RAR-alpha RARA_HUMAN Retinoic acid receptor alpha/Retinoid X receptor alpha Retinoid receptor
Type:
PROTEIN
Mol. Mass.:
50778.87
Organism:
Homo sapiens (Human)
Description:
ChEMBL_1466191
Residue:
462
  
Inhibitor
Name:
BDBM50040011
Synonyms:
4-(3-Bromo-5,5,8,8-tetramethyl-5,6,7,8-tetrahydro-naphthalene-2-carbonyl)-benzoic acid | CHEMBL101712
Type:
Small organic molecule
Emp. Form.:
C22H23BrO3
Mol. Mass.:
415.32
SMILES:
CC1(C)CCC(C)(C)c2cc(C(=O)c3ccc(cc3)C(O)=O)c(Br)cc12
: