Target
Carbonic anhydrase 2
Ligand
BDBM50380157
Substrate
Meas. Tech.
ChEMBL_989829 (CHEMBL2446505)
Kd
67±n/a nM
Citation
 ?apkauskait?, EZubrien?, ASmirnov, ATorresan, JKi?onait?, MKazokait?, JGylyt?, JMichailovien?, VJogait?, VManakova, EGra?ulis, STumkevi?ius, SMatulis, D Benzenesulfonamides with pyrimidine moiety as inhibitors of human carbonic anhydrases I, II, VI, VII, XII, and XIII. Bioorg Med Chem 21:6937-47 (2013)  
Target
Name:
Carbonic anhydrase 2
Synonyms:
CA-II CAC Carbonate dehydratase II Carbonic anhydrase 2 (CA-II) Carbonic anhydrase C Carbonic anhydrase II (CA-II) Carbonic anhydrase II (hCA II) | Carbonic anhydrase isoenzyme II (hCA II)
Type:
Enzyme
Mol. Mass.:
29250.71
Organism:
Homo sapiens (Human)
Description:
P00918
Residue:
260
  
Inhibitor
Name:
BDBM50380157
Synonyms:
CHEMBL2010988
Type:
Small organic molecule
Emp. Form.:
C13H13N3O4S2
Mol. Mass.:
339.39
SMILES:
Cc1cc(=O)[nH]c(SCC(=O)c2ccc(cc2)S(N)(=O)=O)n1
: