Target
Carbonic anhydrase 2
Ligand
BDBM50494022
Substrate
Meas. Tech.
ChEMBL_989677 (CHEMBL2445457)
Ki
11±n/a nM
Citation
 ?apkauskait?, EZubrien?, ASmirnov, ATorresan, JKi?onait?, MKazokait?, JGylyt?, JMichailovien?, VJogait?, VManakova, EGra?ulis, STumkevi?ius, SMatulis, D Benzenesulfonamides with pyrimidine moiety as inhibitors of human carbonic anhydrases I, II, VI, VII, XII, and XIII. Bioorg Med Chem 21:6937-47 (2013)  
Target
Name:
Carbonic anhydrase 2
Synonyms:
CA-II CAC Carbonate dehydratase II Carbonic anhydrase 2 (CA-II) Carbonic anhydrase C Carbonic anhydrase II (CA-II) Carbonic anhydrase II (hCA II) | Carbonic anhydrase isoenzyme II (hCA II)
Type:
Enzyme
Mol. Mass.:
29250.71
Organism:
Homo sapiens (Human)
Description:
P00918
Residue:
260
  
Inhibitor
Name:
BDBM50494022
Synonyms:
CHEMBL2443204
Type:
Small organic molecule
Emp. Form.:
C14H14ClN3O3S2
Mol. Mass.:
371.862
SMILES:
Cc1cc(C)nc(SCC(=O)c2ccc(c(Cl)c2)S(N)(=O)=O)n1
: