Target
Carbonic anhydrase 2
Ligand
BDBM50494017
Substrate
Meas. Tech.
ChEMBL_989677 (CHEMBL2445457)
Ki
167±n/a nM
Citation
 ?apkauskait?, EZubrien?, ASmirnov, ATorresan, JKi?onait?, MKazokait?, JGylyt?, JMichailovien?, VJogait?, VManakova, EGra?ulis, STumkevi?ius, SMatulis, D Benzenesulfonamides with pyrimidine moiety as inhibitors of human carbonic anhydrases I, II, VI, VII, XII, and XIII. Bioorg Med Chem 21:6937-47 (2013)  
Target
Name:
Carbonic anhydrase 2
Synonyms:
CA-II CAC Carbonate dehydratase II Carbonic anhydrase 2 (CA-II) Carbonic anhydrase C Carbonic anhydrase II (CA-II) Carbonic anhydrase II (hCA II) | Carbonic anhydrase isoenzyme II (hCA II)
Type:
Enzyme
Mol. Mass.:
29250.71
Organism:
Homo sapiens (Human)
Description:
P00918
Residue:
260
  
Inhibitor
Name:
BDBM50494017
Synonyms:
CHEMBL2443191
Type:
Small organic molecule
Emp. Form.:
C15H17N3O3S2
Mol. Mass.:
351.444
SMILES:
CCCc1cnc(SCC(=O)c2cccc(c2)S(N)(=O)=O)nc1
: