Target
Sphingosine 1-phosphate receptor 5
Ligand
BDBM50494302
Substrate
Meas. Tech.
ChEMBL_1276038 (CHEMBL3088961)
Ki
>10000±n/a nM
Citation
 Urbano, MGuerrero, MRosen, HRoberts, E Modulators of the Sphingosine 1-phosphate receptor 1. Bioorg Med Chem Lett 23:6377-89 (2013)  
Target
Name:
Sphingosine 1-phosphate receptor 5
Synonyms:
EDG8 S1P5 S1PR5_HUMAN Sphingosine 1-phosphate receptor Edg-8
Type:
G Protein-Coupled Receptor (GPCR)
Mol. Mass.:
41796.42
Organism:
Homo sapiens (Human)
Description:
Residue:
398
  
Inhibitor
Name:
BDBM50494302
Synonyms:
CHEMBL3086532
Type:
Small organic molecule
Emp. Form.:
C13H16ClFN4O3S
Mol. Mass.:
362.808
SMILES:
CCn1c(OC)nnc1[C@@H](C)NS(=O)(=O)c1ccc(F)c(Cl)c1
: