Target
Sigma non-opioid intracellular receptor 1
Ligand
BDBM50006971
Substrate
Meas. Tech.
ChEMBL_200976 (CHEMBL802063)
Ki
9.3±n/a nM
Citation
 Glennon, RAAblordeppey, SYIsmaiel, AMel-Ashmawy, MBFischer, JBHowie, KB Structural features important for sigma 1 receptor binding. J Med Chem 37:1214-9 (1994)  
Target
Name:
Sigma non-opioid intracellular receptor 1
Synonyms:
Aging-associated gene 8 protein SGMR1_HUMAN SIGMAR1 SR31747-binding protein Sigma 1-type opioid receptor Sigma1R | hSigmaR1
Type:
Enzyme Catalytic Domain
Mol. Mass.:
25124.85
Organism:
Homo sapiens (Human)
Description:
Q99720
Residue:
223
  
Inhibitor
Name:
BDBM50006971
Synonyms:
(1-Methyl-2-naphthalen-1-yl-ethyl)-(3-phenyl-propyl)-amine | CHEMBL19082
Type:
Small organic molecule
Emp. Form.:
C22H25N
Mol. Mass.:
303.4406
SMILES:
CC(Cc1cccc2ccccc12)NCCCc1ccccc1
: