Target
Inosine-5'-monophosphate dehydrogenase 2
Ligand
BDBM50494929
Substrate
Meas. Tech.
ChEMBL_1283317 (CHEMBL3101582)
Ki
88±n/a nM
Citation
 Felczak, KVince, RPankiewicz, KW NAD-based inhibitors with anticancer potential. Bioorg Med Chem Lett 24:332-6 (2014)  
Target
Name:
Inosine-5'-monophosphate dehydrogenase 2
Synonyms:
IMDH2_HUMAN IMPD 2 IMPDH-II Inosine 5'-monophosphate dehydrogenase II (IMPDH II) Inosine-5 -monophosphate dehydrogenase 2 | Inosine-5'-monophosphate dehydrogenase (IMPDH)
Type:
Enzyme
Mol. Mass.:
55806.87
Organism:
Homo sapiens (Human)
Description:
Recombinant IMPDH2 expressed in E. coli.
Residue:
514
  
Inhibitor
Name:
BDBM50494929
Synonyms:
CHEMBL3098184
Type:
Small organic molecule
Emp. Form.:
C32H41N7O9
Mol. Mass.:
667.7094
SMILES:
COc1c(C)c2COC(=O)c2c(O)c1C\C=C(/C)CCC(=O)N[C@H](C(C)C)C(=O)NC[C@H]1O[C@H]([C@H](O)[C@@H]1O)n1cnc2c(N)ncnc12
: